Reaction Details
TargetVascular endothelial growth factor receptor 2
LigandBDBM50179891
Substrate/Competitorn/a
Meas. Tech.ChEMBL_495687 (CHEMBL1006966)
IC50 120±n/a nM
Citation Duncton, MAPiatnitski Chekler, ELKatoch-Rouse, RSherman, DWong, WCSmith, LMKawakami, JKKiselyov, ASMilligan, DLBalagtas, CHadari, YRWang, YPatel, SNRolster, RLTonra, JRSurguladze, DMitelman, SKussie, PBohlen, PDoody, JF Arylphthalazines as potent, and orally bioavailable inhibitors of VEGFR-2. Bioorg Med Chem17:731-40 (2009) 
 
Vascular endothelial growth factor receptor 2
Name:Vascular endothelial growth factor receptor 2
Type:Receptor Tyrosine Kinase
Mol. Mass.:151510.97
Organism:Homo sapiens (Human)
Description:P35968
Residue:1356
BDBM50179891
NameBDBM50179891
Synonyms:(4-Chloro-3-trifluoromethylphenyl)-(4-isoquinolin-5-yl-phthalazin-1-yl)amine N-(4-chloro-3-(trifluoromethyl)phenyl)-4-(isoquinolin-5-yl)phthalazin-1-amine
TypeSmall organic molecule
Emp. Form.C24H14ClF3N4
Mol. Mass.450.843
SMILESFC(F)(F)c1cc(Nc2nnc(-c3cccc4cnccc34)c3ccccc23)ccc1Cl