Reaction Details
TargetVascular endothelial growth factor receptor 2
LigandBDBM50173031
Substrate/Competitorn/a
Meas. Tech.ChEMBL_495687 (CHEMBL1006966)
IC50 100±n/a nM
Citation Duncton, MAPiatnitski Chekler, ELKatoch-Rouse, RSherman, DWong, WCSmith, LMKawakami, JKKiselyov, ASMilligan, DLBalagtas, CHadari, YRWang, YPatel, SNRolster, RLTonra, JRSurguladze, DMitelman, SKussie, PBohlen, PDoody, JF Arylphthalazines as potent, and orally bioavailable inhibitors of VEGFR-2. Bioorg Med Chem17:731-40 (2009) 
 
Vascular endothelial growth factor receptor 2
Name:Vascular endothelial growth factor receptor 2
Type:Receptor Tyrosine Kinase
Mol. Mass.:151510.97
Organism:Homo sapiens (Human)
Description:P35968
Residue:1356
BDBM50173031
NameBDBM50173031
Synonyms:4-(4-(4-bromophenylamino)phthalazin-1-yl)benzamide CHEMBL197158
TypeSmall organic molecule
Emp. Form.C21H15BrN4O
Mol. Mass.419.274
SMILESNC(=O)c1ccc(cc1)-c1nnc(Nc2ccc(Br)cc2)c2ccccc12