Reaction Details
TargetProstaglandin F2-alpha receptor
LigandBDBM50035622
Substrate/Competitorn/a
Meas. Tech.ChEMBL_495706 (CHEMBL1006985)
Ki 130±n/a nM
Citation Feng, ZHellberg, MRSharif, NAMcLaughlin, MAWilliams, GWScott, DWallace, T Discovery of 13-oxa prostaglandin analogs as antiglaucoma agents: synthesis and biological activity. Bioorg Med Chem17:576-84 (2009) 
 
Prostaglandin F2-alpha receptor
Name:Prostaglandin F2-alpha receptor
Type:Enzyme Catalytic Domain
Mol. Mass.:41044.75
Organism:BOVINE
Description:ProstaglandinF2Alpha PTGFR BOVINE::P37289
Residue:362
BDBM50035622
NameBDBM50035622
Synonyms:(5Z,13E,15S)-9alpha,11alpha,15-trihydroxyprosta-5,13-dien-1-oic acid DINOPROST l-PGF2-alpha prostaglandin F2alpha
TypeSmall organic molecule
Emp. Form.C20H34O5
Mol. Mass.354.481
SMILESCCCCC[C@H](O)\C=C\[C@H]1[C@H](O)C[C@H](O)[C@@H]1C\C=C/CCCC(O)=O