Reaction Details
TargetGlutamate carboxypeptidase 2
LigandBDBM17659
Substrate/Competitorn/a
Meas. Tech.ChEMBL_559824 (CHEMBL1020695)
Kd 0.4±n/a nM
Citation Humblet, VMisra, PBhushan, KRNasr, KKo, YSTsukamoto, TPannier, NFrangioni, JVMaison, W Multivalent scaffolds for affinity maturation of small molecule cell surface binders and their application to prostate tumor targeting. J Med Chem52:544-50 (2009) 
 
Glutamate carboxypeptidase 2
Name:Glutamate carboxypeptidase 2
Type:PROTEIN
Mol. Mass.:84333.66
Organism:Homo sapiens (Human)
Description:ChEMBL_1497035
Residue:750
BDBM17659
NameBDBM17659
Synonyms:(R,S)-2-phosphonomethylpentanedioic acid 2-PMPA US10894807, ID P009 | pentanedioic acid analogue, (RS)-1
TypeSmall organic molecule
Emp. Form.C6H11O7P
Mol. Mass.226.1211
SMILESOC(=O)CCC(CP(O)(O)=O)C(O)=O