Reaction Details
TargetAdenosine receptor A2a
LigandBDBM50255989
Substrate/Competitorn/a
Meas. Tech.ChEMBL_515145 (CHEMBL1024667)
Ki 1±n/a nM
Citation Neustadt, BRLiu, HHao, JGreenlee, WJStamford, AWFoster, CArik, LLachowicz, JZhang, HBertorelli, RFredduzzi, SVarty, GCohen-Williams, MNg, K Potent and selective adenosine A2A receptor antagonists: 1,2,4-Triazolo[1,5-c]pyrimidines. Bioorg Med Chem Lett19:967-71 (2009) 
 
Adenosine receptor A2a
Name:Adenosine receptor A2a
Type:G Protein-Coupled Receptor (GPCR)
Mol. Mass.:44716.46
Organism:Homo sapiens (Human)
Description:P29274
Residue:412
BDBM50255989
NameBDBM50255989
Synonyms:CHEMBL519271 | N7-(4-fluorophenethyl)-2-(furan-2-yl)-N7-(2-methoxyethyl)-[1,2,4]triazolo[1,5-c]pyrimidine-5,7-diamine
TypeSmall organic molecule
Emp. Form.C20H21FN6O2
Mol. Mass.396.4181
SMILESCOCCN(CCc1ccc(F)cc1)c1cc2nc(nn2c(N)n1)-c1ccco1