Reaction Details
TargetAdenosine receptor A2a
LigandBDBM50256298
Substrate/Competitorn/a
Meas. Tech.ChEMBL_515145 (CHEMBL1024667)
Ki 0.9±n/a nM
Citation Neustadt, BRLiu, HHao, JGreenlee, WJStamford, AWFoster, CArik, LLachowicz, JZhang, HBertorelli, RFredduzzi, SVarty, GCohen-Williams, MNg, K Potent and selective adenosine A2A receptor antagonists: 1,2,4-Triazolo[1,5-c]pyrimidines. Bioorg Med Chem Lett19:967-71 (2009) 
 
Adenosine receptor A2a
Name:Adenosine receptor A2a
Type:G Protein-Coupled Receptor (GPCR)
Mol. Mass.:44716.46
Organism:Homo sapiens (Human)
Description:P29274
Residue:412
BDBM50256298
NameBDBM50256298
Synonyms:CHEMBL473431 | N7-(2-(4-(2,4-difluorophenyl)piperazin-1-yl)ethyl)-N7-ethyl-2-(furan-2-yl)-[1,2,4]triazolo[1,5-c]pyrimidine-5,7-diamine
TypeSmall organic molecule
Emp. Form.C23H26F2N8O
Mol. Mass.468.5023
SMILESCCN(CCN1CCN(CC1)c1ccc(F)cc1F)c1cc2nc(nn2c(N)n1)-c1ccco1