Reaction Details
TargetAdenosine receptor A2a
LigandBDBM50256363
Substrate/Competitorn/a
Meas. Tech.ChEMBL_515145 (CHEMBL1024667)
Ki 0.8±n/a nM
Citation Neustadt, BRLiu, HHao, JGreenlee, WJStamford, AWFoster, CArik, LLachowicz, JZhang, HBertorelli, RFredduzzi, SVarty, GCohen-Williams, MNg, K Potent and selective adenosine A2A receptor antagonists: 1,2,4-Triazolo[1,5-c]pyrimidines. Bioorg Med Chem Lett19:967-71 (2009) 
 
Adenosine receptor A2a
Name:Adenosine receptor A2a
Type:G Protein-Coupled Receptor (GPCR)
Mol. Mass.:44716.46
Organism:Homo sapiens (Human)
Description:P29274
Residue:412
BDBM50256363
NameBDBM50256363
Synonyms:CHEMBL512337 | N7-(cyclopropylmethyl)-2-(furan-2-yl)-N7-(2-(4-(4-(2-methoxyethoxy)phenyl)piperazin-1-yl)ethyl)-[1,2,4]triazolo[1,5-c]pyrimidine-5,7-diamine
TypeSmall organic molecule
Emp. Form.C28H36N8O3
Mol. Mass.532.6372
SMILESCOCCOc1ccc(cc1)N1CCN(CCN(CC2CC2)c2cc3nc(nn3c(N)n2)-c2ccco2)CC1