Reaction Details
TargetSerine/threonine-protein kinase Chk1
LigandBDBM50256002
Substrate/Competitorn/a
Meas. Tech.ChEMBL_515217 (CHEMBL990372)
IC50 460±n/a nM
Citation Parmentier, JGPortevin, BGolsteyn, RMPierré, AHickman, JGloanec, PDe Nanteuil, G Synthesis and CHK1 inhibitory potency of Hymenialdisine analogues. Bioorg Med Chem Lett19:841-4 (2009) 
 
Serine/threonine-protein kinase Chk1
Name:Serine/threonine-protein kinase Chk1
Type:Enzyme Catalytic Domain
Mol. Mass.:54443.02
Organism:Homo sapiens (Human)
Description:gi_166295192
Residue:476
BDBM50256002
NameBDBM50256002
Synonyms:4-[2-Amino-5-oxo-3,5-dihydro-imidazol-(4)-ylidene]-2-bromo-4,6,7,9-tetrahydro-5H-3-thia-7,9-diaza-cyclopenta[a]azulen-8-one | CHEMBL514818
TypeSmall organic molecule
Emp. Form.C13H10BrN5O2S
Mol. Mass.380.22
SMILESNC1=NC(C(=O)N1)=C1CCNC(=O)c2[nH]c3cc(Br)sc3c12