Reaction Details
TargetSerine/threonine-protein kinase Chk1
LigandBDBM7491
Substrate/Competitorn/a
Meas. Tech.ChEMBL_515217 (CHEMBL990372)
IC50 1900±n/a nM
Citation Parmentier, JGPortevin, BGolsteyn, RMPierré, AHickman, JGloanec, PDe Nanteuil, G Synthesis and CHK1 inhibitory potency of Hymenialdisine analogues. Bioorg Med Chem Lett19:841-4 (2009) 
 
Serine/threonine-protein kinase Chk1
Name:Serine/threonine-protein kinase Chk1
Type:Enzyme Catalytic Domain
Mol. Mass.:54443.02
Organism:Homo sapiens (Human)
Description:gi_166295192
Residue:476
BDBM7491
NameBDBM7491
Synonyms:(4Z)-4-(2-amino-5-oxo-3,5-dihydro-4H-imidazol-4-ylidene)-2-bromo-4,5,6,7-tetrahydropyrrolo[2,3-c]azepin-8(1H)-one (Z)-hymenialdisine 4-(2-Amino-4-oxo-2-imidazolidin-5-ylidene)-2-bromo-4,5,6,7-tetrahydropyrrolo[2,3-c]azepin-8-one 4-(2-amino-4-oxo-1H-imidazol-5(4H)-ylidene)-2-bromo-4,5,6,7-tetrahydropyrrolo[2,3-c]azepin-8(1H)-one 4-[2-Amino-5-oxo-3,5-dihydro-imidazol-(4Z)-ylidene]-2-bromo-4,5,6,7-tetrahydro-1H-pyrrolo[2,3-c]azepin-8-one Hymenialdisine | Hymenialdisine, 1
TypeSmall organic molecule
Emp. Form.C11H10BrN5O2
Mol. Mass.324.133
SMILESNC1=NC(=O)C(N1)=C1CCNC(=O)c2[nH]c(Br)cc12