Reaction Details
TargetSerine/threonine-protein kinase Chk1
LigandBDBM50256025
Substrate/Competitorn/a
Meas. Tech.ChEMBL_515217 (CHEMBL990372)
IC50 150±n/a nM
Citation Parmentier, JGPortevin, BGolsteyn, RMPierré, AHickman, JGloanec, PDe Nanteuil, G Synthesis and CHK1 inhibitory potency of Hymenialdisine analogues. Bioorg Med Chem Lett19:841-4 (2009) 
 
Serine/threonine-protein kinase Chk1
Name:Serine/threonine-protein kinase Chk1
Type:Enzyme Catalytic Domain
Mol. Mass.:54443.02
Organism:Homo sapiens (Human)
Description:gi_166295192
Residue:476
BDBM50256025
NameBDBM50256025
Synonyms:4-[2-Amino-5-oxo-3,5-dihydro-imidazol-(4)-ylidene]-8-oxo-4,5,6,7,8,9-hexahydro-3-thia-7,9-diaza-cyclopenta[a]azulene-1-carboxylic acid amide | CHEMBL520929
TypeSmall organic molecule
Emp. Form.C14H12N6O3S
Mol. Mass.344.348
SMILESNC(=O)c1csc2c3c([nH]c12)C(=O)NCCC3=C1N=C(N)NC1=O