Reaction Details
TargetSerine/threonine-protein kinase Chk1
LigandBDBM50256028
Substrate/Competitorn/a
Meas. Tech.ChEMBL_515217 (CHEMBL990372)
IC50 180±n/a nM
Citation Parmentier, JGPortevin, BGolsteyn, RMPierré, AHickman, JGloanec, PDe Nanteuil, G Synthesis and CHK1 inhibitory potency of Hymenialdisine analogues. Bioorg Med Chem Lett19:841-4 (2009) 
 
Serine/threonine-protein kinase Chk1
Name:Serine/threonine-protein kinase Chk1
Type:Enzyme Catalytic Domain
Mol. Mass.:54443.02
Organism:Homo sapiens (Human)
Description:gi_166295192
Residue:476
BDBM50256028
NameBDBM50256028
Synonyms:4-[2-Amino-4-oxo-4H-thiazol-(5)-ylidene]-4,6,7,9-tetrahydro-5H-3-thia-7,9-diaza-cyclopenta[a]azulen-8-one | CHEMBL511293
TypeSmall organic molecule
Emp. Form.C13H10N4O2S2
Mol. Mass.318.374
SMILESNC1=NC(=O)C(S1)=C1CCNC(=O)c2[nH]c3ccsc3c12