Reaction Details
TargetSerine/threonine-protein kinase Chk1
LigandBDBM50256008
Substrate/Competitorn/a
Meas. Tech.ChEMBL_515217 (CHEMBL990372)
IC50 260±n/a nM
Citation Parmentier, JGPortevin, BGolsteyn, RMPierré, AHickman, JGloanec, PDe Nanteuil, G Synthesis and CHK1 inhibitory potency of Hymenialdisine analogues. Bioorg Med Chem Lett19:841-4 (2009) 
 
Serine/threonine-protein kinase Chk1
Name:Serine/threonine-protein kinase Chk1
Type:Enzyme Catalytic Domain
Mol. Mass.:54443.02
Organism:Homo sapiens (Human)
Description:gi_166295192
Residue:476
BDBM50256008
NameBDBM50256008
Synonyms:CHEMBL517241 | {5-[1-Bromo-8-oxo-6,7,8,9-tetrahydro-5H-3-thia-7,9-diaza-cyclopenta[a]azulen-(4)-ylidene]-4-oxo-4,5-dihydro-1H-imidazol-2-ylamino}-acetic acid
TypeSmall organic molecule
Emp. Form.C15H12BrN5O4S
Mol. Mass.438.256
SMILESOC(=O)CNC1=NC(C(=O)N1)=C1CCNC(=O)c2[nH]c3c(Br)csc3c12