Reaction Details
TargetSerine/threonine-protein kinase Chk1
LigandBDBM50256030
Substrate/Competitorn/a
Meas. Tech.ChEMBL_515217 (CHEMBL990372)
IC50 280±n/a nM
Citation Parmentier, JGPortevin, BGolsteyn, RMPierré, AHickman, JGloanec, PDe Nanteuil, G Synthesis and CHK1 inhibitory potency of Hymenialdisine analogues. Bioorg Med Chem Lett19:841-4 (2009) 
 
Serine/threonine-protein kinase Chk1
Name:Serine/threonine-protein kinase Chk1
Type:Enzyme Catalytic Domain
Mol. Mass.:54443.02
Organism:Homo sapiens (Human)
Description:gi_166295192
Residue:476
BDBM50256030
NameBDBM50256030
Synonyms:1-Bromo-4-[2-(2-hydroxy-ethylamino)-5-oxo-3,5-dihydro-imidazol-(4)-ylidene]-4,6,7,9-tetrahydro-5H-3-thia-7,9-diaza-cyclopenta[a]azulen-8-one | CHEMBL470937
TypeSmall organic molecule
Emp. Form.C15H14BrN5O3S
Mol. Mass.424.272
SMILESOCCNC1=NC(C(=O)N1)=C1CCNC(=O)c2[nH]c3c(Br)csc3c12