Reaction Details
TargetHistone deacetylase 6
LigandBDBM50255914
Substrate/Competitorn/a
Meas. Tech.ChEMBL_515267 (CHEMBL991291)
IC50 40±n/a nM
Citation Smil, DVManku, SChantigny, YALeit, SWahhab, AYan, TPFournel, MMaroun, CLi, ZLemieux, AMNicolescu, ARahil, JLefebvre, SPanetta, ABesterman, JMDéziel, R Novel HDAC6 isoform selective chiral small molecule histone deacetylase inhibitors. Bioorg Med Chem Lett19:688-92 (2009) 
 
Histone deacetylase 6
Name:Histone deacetylase 6
Type:Chromatin regulator; hydrolase; repressor
Mol. Mass.:131381.51
Organism:Homo sapiens (Human)
Description:Q9UBN7
Residue:1215
BDBM50255914
NameBDBM50255914
Synonyms:4-(((R)-2,3-dihydro-2-oxo-3-((thiophen-2-yl)methyl)quinoxalin-4(1H)-yl)methyl)-N-hydroxybenzamide | CHEMBL518957
TypeSmall organic molecule
Emp. Form.C21H19N3O3S
Mol. Mass.393.459
SMILESONC(=O)c1ccc(CN2[C@H](Cc3cccs3)C(=O)Nc3ccccc23)cc1