Reaction Details
TargetHistone acetyltransferase KAT2B
LigandBDBM50247840
Substrate/Competitorn/a
Meas. Tech.ChEMBL_496186 (CHEMBL1001098)
IC50 2500±n/a nM
Citation Dekker, FJGhizzoni, Mvan der Meer, NWisastra, RHaisma, HJ Inhibition of the PCAF histone acetyl transferase and cell proliferation by isothiazolones. Bioorg Med Chem17:460-6 (2009) 
 
Histone acetyltransferase KAT2B
Name:Histone acetyltransferase KAT2B
Type:PROTEIN
Mol. Mass.:93045.76
Organism:Homo sapiens (Human)
Description:ChEMBL_1502838
Residue:832
BDBM50247840
NameBDBM50247840
Synonyms:CHEMBL489116 | Methyl 4-(5-chloro-3-oxoisothiazol-2(3H)-yl)butanoate
TypeSmall organic molecule
Emp. Form.C8H10ClNO3S
Mol. Mass.235.688
SMILESCOC(=O)CCCn1sc(Cl)cc1=O