Reaction Details
TargetHistone acetyltransferase KAT2B
LigandBDBM50247842
Substrate/Competitorn/a
Meas. Tech.ChEMBL_496186 (CHEMBL1001098)
IC50 3200±n/a nM
Citation Dekker, FJGhizzoni, Mvan der Meer, NWisastra, RHaisma, HJ Inhibition of the PCAF histone acetyl transferase and cell proliferation by isothiazolones. Bioorg Med Chem17:460-6 (2009) 
 
Histone acetyltransferase KAT2B
Name:Histone acetyltransferase KAT2B
Type:PROTEIN
Mol. Mass.:93045.76
Organism:Homo sapiens (Human)
Description:ChEMBL_1502838
Residue:832
BDBM50247842
NameBDBM50247842
Synonyms:CHEMBL442599 | Methyl 6-(5-chloro-3-oxoisothiazol-2(3H)-yl)hexanoate
TypeSmall organic molecule
Emp. Form.C10H14ClNO3S
Mol. Mass.263.741
SMILESCOC(=O)CCCCCn1sc(Cl)cc1=O