Reaction Details
TargetHistone acetyltransferase KAT2B
LigandBDBM50247868
Substrate/Competitorn/a
Meas. Tech.ChEMBL_496186 (CHEMBL1001098)
IC50 4200±n/a nM
Citation Dekker, FJGhizzoni, Mvan der Meer, NWisastra, RHaisma, HJ Inhibition of the PCAF histone acetyl transferase and cell proliferation by isothiazolones. Bioorg Med Chem17:460-6 (2009) 
 
Histone acetyltransferase KAT2B
Name:Histone acetyltransferase KAT2B
Type:PROTEIN
Mol. Mass.:93045.76
Organism:Homo sapiens (Human)
Description:ChEMBL_1502838
Residue:832
BDBM50247868
NameBDBM50247868
Synonyms:2-(3-Chloro-4-fluorophenyl)isothiazol-3(2H)-one | CHEMBL510900
TypeSmall organic molecule
Emp. Form.C9H5ClFNOS
Mol. Mass.229.659
SMILESFc1ccc(cc1Cl)-n1sccc1=O