Reaction Details
TargetMacrophage colony-stimulating factor 1 receptor
LigandBDBM50255697
Substrate/Competitorn/a
Meas. Tech.ChEMBL_515273 (CHEMBL991297)
IC50 3±n/a nM
Citation Scott, DABalliet, CLCook, DJDavies, AMGero, TWOmer, CAPoondru, STheoclitou, METyurin, BZinda, MJ Identification of 3-amido-4-anilinoquinolines as potent and selective inhibitors of CSF-1R kinase. Bioorg Med Chem Lett19:697-700 (2009) 
 
Macrophage colony-stimulating factor 1 receptor
Name:Macrophage colony-stimulating factor 1 receptor
Type:Protein
Mol. Mass.:107979.48
Organism:Homo sapiens (Human)
Description:P07333
Residue:972
BDBM50255697
NameBDBM50255697
Synonyms:4-(2,3-dichlorophenylamino)-6-(2-(dimethylamino)ethylamino)-7-ethoxyquinoline-3-carboxamide | CHEMBL480814
TypeSmall organic molecule
Emp. Form.C22H25Cl2N5O2
Mol. Mass.462.372
SMILESCCOc1cc2ncc(C(N)=O)c(Nc3cccc(Cl)c3Cl)c2cc1NCCN(C)C