Reaction Details
TargetGastrin/cholecystokinin type B receptor
LigandBDBM50265490
Substrate/Competitorn/a
Meas. Tech.ChEMBL_559853 (CHEMBL1021534)
Ki 3.9±n/a nM
Citation Zheng, YAkgün, EHarikumar, KGHopson, JPowers, MDLunzer, MMMiller, LJPortoghese, PS Induced association of mu opioid (MOP) and type 2 cholecystokinin (CCK2) receptors by novel bivalent ligands. J Med Chem52:247-58 (2009) 
 
Gastrin/cholecystokinin type B receptor
Name:Gastrin/cholecystokinin type B receptor
Type:G Protein-Coupled Receptor (GPCR)
Mol. Mass.:48445.79
Organism:Homo sapiens (Human)
Description:Stable expression of human CCK-2 receptors in HEK 293 cells.
Residue:447
BDBM50265490
NameBDBM50265490
Synonyms:CHEMBL501238 | N-{m-[R(+)-1]Ureaphenoxy}ethyldiglycolamidehydrazide-N'-oxymorphyldiglycolamidedihydrazide
TypeSmall organic molecule
Emp. Form.C50H55N9O12
Mol. Mass.974.0248
SMILESCN1CC[C@]23[C@H]4Oc5cc(O)cc(C[C@@H]1[C@]2(O)CC[C@@H]4NC(=O)COCC(=O)NNC(=O)COCC(=O)NCCOc1cccc(NC(=O)N[C@@H]2N=C(c4ccccc4)c4ccccc4N(C)C2=O)c1)c35