Reaction Details
TargetVascular endothelial growth factor receptor 3
LigandBDBM25118
Substrate/Competitorn/a
Meas. Tech.ChEMBL_559893 (CHEMBL1011004)
IC50 3±n/a nM
Citation Renhowe, PAPecchi, SShafer, CMMachajewski, TDJazan, EMTaylor, CAntonios-McCrea, WMcBride, CMFrazier, KWiesmann, MLapointe, GRFeucht, PHWarne, RLHeise, CCMenezes, DAardalen, KYe, HHe, MLe, VVora, JJansen, JMWernette-Hammond, MEHarris, AL Design, structure-activity relationships and in vivo characterization of 4-amino-3-benzimidazol-2-ylhydroquinolin-2-ones: a novel class of receptor tyrosine kinase inhibitors. J Med Chem52:278-92 (2009) 
 
Vascular endothelial growth factor receptor 3
Name:Vascular endothelial growth factor receptor 3
Type:Protein
Mol. Mass.:152749.58
Organism:Homo sapiens (Human)
Description:P35916-2
Residue:1363
BDBM25118
NameBDBM25118
Synonyms:(3Z)-4-amino-5-fluoro-3-[5-(4-methylpiperazino)-1,3-dihydrobenzimidazol-2-ylidene]carbostyril CHEMBL522892 | CHIR-258
TypeSmall organic molecule
Emp. Form.C21H21FN6O
Mol. Mass.392.4294
SMILESCN1CCN(CC1)c1ccc2nc([nH]c2c1)-c1c(N)c2c(F)cccc2[nH]c1=O