Reaction Details
TargetPlatelet-derived growth factor receptor beta
LigandBDBM50265774
Substrate/Competitorn/a
Meas. Tech.ChEMBL_559890 (CHEMBL1011001)
IC50 0.100000±n/a nM
Citation Renhowe, PAPecchi, SShafer, CMMachajewski, TDJazan, EMTaylor, CAntonios-McCrea, WMcBride, CMFrazier, KWiesmann, MLapointe, GRFeucht, PHWarne, RLHeise, CCMenezes, DAardalen, KYe, HHe, MLe, VVora, JJansen, JMWernette-Hammond, MEHarris, AL Design, structure-activity relationships and in vivo characterization of 4-amino-3-benzimidazol-2-ylhydroquinolin-2-ones: a novel class of receptor tyrosine kinase inhibitors. J Med Chem52:278-92 (2009) 
 
Platelet-derived growth factor receptor beta
Name:Platelet-derived growth factor receptor beta
Type:Enzyme
Mol. Mass.:123922.25
Organism:Homo sapiens (Human)
Description:P09619
Residue:1106
BDBM50265774
NameBDBM50265774
Synonyms:4-Amino-3-benzimidazol-2-yl-5-(1-methyl(3-piperidyloxy))hydroquinolin-2-one | CHEMBL495749
TypeSmall organic molecule
Emp. Form.C22H23N5O2
Mol. Mass.389.4503
SMILESCN1CCCC(C1)Oc1cccc2[nH]c(=O)c(-c3nc4ccccc4[nH]3)c(N)c12