Reaction Details
TargetVascular endothelial growth factor receptor 2
LigandBDBM50265572
Substrate/Competitorn/a
Meas. Tech.ChEMBL_559888 (CHEMBL1010124)
IC50 220±n/a nM
Citation Renhowe, PAPecchi, SShafer, CMMachajewski, TDJazan, EMTaylor, CAntonios-McCrea, WMcBride, CMFrazier, KWiesmann, MLapointe, GRFeucht, PHWarne, RLHeise, CCMenezes, DAardalen, KYe, HHe, MLe, VVora, JJansen, JMWernette-Hammond, MEHarris, AL Design, structure-activity relationships and in vivo characterization of 4-amino-3-benzimidazol-2-ylhydroquinolin-2-ones: a novel class of receptor tyrosine kinase inhibitors. J Med Chem52:278-92 (2009) 
 
Vascular endothelial growth factor receptor 2
Name:Vascular endothelial growth factor receptor 2
Type:Receptor Tyrosine Kinase
Mol. Mass.:151510.97
Organism:Homo sapiens (Human)
Description:P35968
Residue:1356
BDBM50265572
NameBDBM50265572
Synonyms:3-(1H-benzo[d]imidazol-2-yl)-4-(methylamino)quinolin-2(1H)-one | CHEMBL521552
TypeSmall organic molecule
Emp. Form.C17H14N4O
Mol. Mass.290.3193
SMILESCNc1c(-c2nc3ccccc3[nH]2)c(=O)[nH]c2ccccc12