Reaction Details
TargetFibroblast growth factor receptor 1
LigandBDBM50265675
Substrate/Competitorn/a
Meas. Tech.ChEMBL_559889 (CHEMBL1010125)
IC50 9±n/a nM
Citation Renhowe, PAPecchi, SShafer, CMMachajewski, TDJazan, EMTaylor, CAntonios-McCrea, WMcBride, CMFrazier, KWiesmann, MLapointe, GRFeucht, PHWarne, RLHeise, CCMenezes, DAardalen, KYe, HHe, MLe, VVora, JJansen, JMWernette-Hammond, MEHarris, AL Design, structure-activity relationships and in vivo characterization of 4-amino-3-benzimidazol-2-ylhydroquinolin-2-ones: a novel class of receptor tyrosine kinase inhibitors. J Med Chem52:278-92 (2009) 
 
Fibroblast growth factor receptor 1
Name:Fibroblast growth factor receptor 1
Type:Receptor
Mol. Mass.:91861.70
Organism:Homo sapiens (Human)
Description:P11362
Residue:822
BDBM50265675
NameBDBM50265675
Synonyms:4-Amino-3-(6-((4-methylpiperazin-1-yl)methyl)-1H-benzo[d]imidazol-2-yl)quinolin-2(1H)-one | CHEMBL495961
TypeSmall organic molecule
Emp. Form.C22H24N6O
Mol. Mass.388.4656
SMILESCN1CCN(Cc2ccc3nc([nH]c3c2)-c2c(N)c3ccccc3[nH]c2=O)CC1