Reaction Details
TargetFibroblast growth factor receptor 1
LigandBDBM50265615
Substrate/Competitorn/a
Meas. Tech.ChEMBL_559889 (CHEMBL1010125)
IC50 70±n/a nM
Citation Renhowe, PAPecchi, SShafer, CMMachajewski, TDJazan, EMTaylor, CAntonios-McCrea, WMcBride, CMFrazier, KWiesmann, MLapointe, GRFeucht, PHWarne, RLHeise, CCMenezes, DAardalen, KYe, HHe, MLe, VVora, JJansen, JMWernette-Hammond, MEHarris, AL Design, structure-activity relationships and in vivo characterization of 4-amino-3-benzimidazol-2-ylhydroquinolin-2-ones: a novel class of receptor tyrosine kinase inhibitors. J Med Chem52:278-92 (2009) 
 
Fibroblast growth factor receptor 1
Name:Fibroblast growth factor receptor 1
Type:Receptor
Mol. Mass.:91861.70
Organism:Homo sapiens (Human)
Description:P11362
Residue:822
BDBM50265615
NameBDBM50265615
Synonyms:4-Amino-3-(5,6-dimethylbenzimidazol-2-yl)hydroquinolin-2-one | CHEMBL498206
TypeSmall organic molecule
Emp. Form.C18H16N4O
Mol. Mass.304.3458
SMILESCc1cc2nc([nH]c2cc1C)-c1c(N)c2ccccc2[nH]c1=O