Reaction Details
TargetFibroblast growth factor receptor 1
LigandBDBM50265573
Substrate/Competitorn/a
Meas. Tech.ChEMBL_559889 (CHEMBL1010125)
IC50 390±n/a nM
Citation Renhowe, PAPecchi, SShafer, CMMachajewski, TDJazan, EMTaylor, CAntonios-McCrea, WMcBride, CMFrazier, KWiesmann, MLapointe, GRFeucht, PHWarne, RLHeise, CCMenezes, DAardalen, KYe, HHe, MLe, VVora, JJansen, JMWernette-Hammond, MEHarris, AL Design, structure-activity relationships and in vivo characterization of 4-amino-3-benzimidazol-2-ylhydroquinolin-2-ones: a novel class of receptor tyrosine kinase inhibitors. J Med Chem52:278-92 (2009) 
 
Fibroblast growth factor receptor 1
Name:Fibroblast growth factor receptor 1
Type:Receptor
Mol. Mass.:91861.70
Organism:Homo sapiens (Human)
Description:P11362
Residue:822
BDBM50265573
NameBDBM50265573
Synonyms:3-(1H-benzo[d]imidazol-2-yl)-4-(dimethylamino)quinolin-2(1H)-one | CHEMBL495983
TypeSmall organic molecule
Emp. Form.C18H16N4O
Mol. Mass.304.3458
SMILESCN(C)c1c(-c2nc3ccccc3[nH]2)c(=O)[nH]c2ccccc12