Reaction Details
TargetHistone deacetylase 1
LigandBDBM50255468
Substrate/Competitorn/a
Meas. Tech.ChEMBL_515326 (CHEMBL1035661)
IC50 140±n/a nM
Citation Raeppel, SZhou, NGaudette, FLeit, SPaquin, ILarouche, GMoradei, OFréchette, SIsakovic, LDelorme, DFournel, MKalita, ALu, ATrachy-Bourget, MCYan, PTLiu, JRahil, JWang, JBesterman, JMMurakami, KLi, ZVaisburg, A SAR and biological evaluation of analogues of a small molecule histone deacetylase inhibitor N-(2-aminophenyl)-4-((4-(pyridin-3-yl)pyrimidin-2-ylamino)methyl)benzamide (MGCD0103). Bioorg Med Chem Lett19:644-9 (2009) 
 
Histone deacetylase 1
Name:Histone deacetylase 1
Type:Enzyme
Mol. Mass.:55090.27
Organism:Homo sapiens (Human)
Description:Q13547
Residue:482
BDBM50255468
NameBDBM50255468
Synonyms:CHEMBL515292 | N-(2-aminophenyl)-4-((4-(3-(2-morpholinoethoxy)phenyl)pyrimidin-2-ylamino)methyl)benzamide
TypeSmall organic molecule
Emp. Form.C30H32N6O3
Mol. Mass.524.6135
SMILESNc1ccccc1NC(=O)c1ccc(CNc2nccc(n2)-c2cccc(OCCN3CCOCC3)c2)cc1