Reaction Details
TargetHistone deacetylase 1
LigandBDBM50255857
Substrate/Competitorn/a
Meas. Tech.ChEMBL_515326 (CHEMBL1035661)
IC50>20000±n/a nM
Citation Raeppel, SZhou, NGaudette, FLeit, SPaquin, ILarouche, GMoradei, OFréchette, SIsakovic, LDelorme, DFournel, MKalita, ALu, ATrachy-Bourget, MCYan, PTLiu, JRahil, JWang, JBesterman, JMMurakami, KLi, ZVaisburg, A SAR and biological evaluation of analogues of a small molecule histone deacetylase inhibitor N-(2-aminophenyl)-4-((4-(pyridin-3-yl)pyrimidin-2-ylamino)methyl)benzamide (MGCD0103). Bioorg Med Chem Lett19:644-9 (2009) 
 
Histone deacetylase 1
Name:Histone deacetylase 1
Type:Enzyme
Mol. Mass.:55090.27
Organism:Homo sapiens (Human)
Description:Q13547
Residue:482
BDBM50255857
NameBDBM50255857
Synonyms:CHEMBL481556 | N-(2-aminophenyl)-3-((4-(pyridin-3-yl)pyrimidin-2-ylamino)methyl)benzamide
TypeSmall organic molecule
Emp. Form.C23H20N6O
Mol. Mass.396.4445
SMILESNc1ccccc1NC(=O)c1cccc(CNc2nccc(n2)-c2cccnc2)c1