Reaction Details
TargetHistone deacetylase 6
LigandBDBM24624
Substrate/Competitorn/a
Meas. Tech.ChEMBL_515336 (CHEMBL1036513)
IC50>10000±n/a nM
Citation Raeppel, SZhou, NGaudette, FLeit, SPaquin, ILarouche, GMoradei, OFréchette, SIsakovic, LDelorme, DFournel, MKalita, ALu, ATrachy-Bourget, MCYan, PTLiu, JRahil, JWang, JBesterman, JMMurakami, KLi, ZVaisburg, A SAR and biological evaluation of analogues of a small molecule histone deacetylase inhibitor N-(2-aminophenyl)-4-((4-(pyridin-3-yl)pyrimidin-2-ylamino)methyl)benzamide (MGCD0103). Bioorg Med Chem Lett19:644-9 (2009) 
 
Histone deacetylase 6
Name:Histone deacetylase 6
Type:Chromatin regulator; hydrolase; repressor
Mol. Mass.:131381.51
Organism:Homo sapiens (Human)
Description:Q9UBN7
Residue:1215
BDBM24624
NameBDBM24624
Synonyms:CHEMBL272980 MGCD0103 US10227295, Compound MGCD0103 US9409858, MGCD0103 US9956192, Compound MGCD0103
TypeSmall organic molecule
Emp. Form.C23H20N6O
Mol. Mass.396.4445
SMILESNc1ccccc1NC(=O)c1ccc(CNc2nccc(n2)-c2cccnc2)cc1