Reaction Details
TargetTransient receptor potential cation channel subfamily V member 1
LigandBDBM50255471
Substrate/Competitorn/a
Meas. Tech.ChEMBL_515381 (CHEMBL1025536)
IC50 59±n/a nM
Citation Xiao, DPalani, AAslanian, RMcKittrick, BAMcPhail, ATCorrell, CCPhelps, PTAnthes, JCRindgen, D Spiro-piperidine azetidinones as potent TRPV1 antagonists. Bioorg Med Chem Lett19:783-7 (2009) 
 
Transient receptor potential cation channel subfamily V member 1
Name:Transient receptor potential cation channel subfamily V member 1
Type:Protein
Mol. Mass.:94960.75
Organism:Homo sapiens (Human)
Description:Q8NER1
Residue:839
BDBM50255471
NameBDBM50255471
Synonyms:CHEMBL518965 | N-(4-tert-butylphenyl)-1-oxo-2-phenyl-2,7-diazaspiro[3.5]nonane-7-carboxamide
TypeSmall organic molecule
Emp. Form.C24H29N3O2
Mol. Mass.391.506
SMILESCC(C)(C)c1ccc(NC(=O)N2CCC3(CN(C3=O)c3ccccc3)CC2)cc1