Reaction Details
TargetTransient receptor potential cation channel subfamily V member 1
LigandBDBM50255382
Substrate/Competitorn/a
Meas. Tech.ChEMBL_515379 (CHEMBL1025534)
IC50 49±n/a nM
Citation Xiao, DPalani, AAslanian, RMcKittrick, BAMcPhail, ATCorrell, CCPhelps, PTAnthes, JCRindgen, D Spiro-piperidine azetidinones as potent TRPV1 antagonists. Bioorg Med Chem Lett19:783-7 (2009) 
 
Transient receptor potential cation channel subfamily V member 1
Name:Transient receptor potential cation channel subfamily V member 1
Type:Protein
Mol. Mass.:94960.75
Organism:Homo sapiens (Human)
Description:Q8NER1
Residue:839
BDBM50255382
NameBDBM50255382
Synonyms:(S)-N-((1r,4S)-4-tert-butylcyclohexyl)-1-oxo-2,3-diphenyl-2,7-diazaspiro[3.5]nonane-7-carboxamide | CHEMBL481609
TypeSmall organic molecule
Emp. Form.C30H39N3O2
Mol. Mass.473.6496
SMILESCC(C)(C)[C@H]1CC[C@@H](CC1)NC(=O)N1CCC2(CC1)[C@@H](N(C2=O)c1ccccc1)c1ccccc1