Reaction Details
TargetTransient receptor potential cation channel subfamily V member 1
LigandBDBM50255381
Substrate/Competitorn/a
Meas. Tech.ChEMBL_515381 (CHEMBL1025536)
IC50 113±n/a nM
Citation Xiao, DPalani, AAslanian, RMcKittrick, BAMcPhail, ATCorrell, CCPhelps, PTAnthes, JCRindgen, D Spiro-piperidine azetidinones as potent TRPV1 antagonists. Bioorg Med Chem Lett19:783-7 (2009) 
 
Transient receptor potential cation channel subfamily V member 1
Name:Transient receptor potential cation channel subfamily V member 1
Type:Protein
Mol. Mass.:94960.75
Organism:Homo sapiens (Human)
Description:Q8NER1
Residue:839
BDBM50255381
NameBDBM50255381
Synonyms:CHEMBL479646 | N-(4-isopropylphenyl)-1-oxo-2,3-diphenyl-2,7-diazaspiro[3.5]nonane-7-carboxamide
TypeSmall organic molecule
Emp. Form.C29H31N3O2
Mol. Mass.453.5753
SMILESCC(C)c1ccc(NC(=O)N2CCC3(CC2)C(N(C3=O)c2ccccc2)c2ccccc2)cc1