Reaction Details
TargetCytochrome P450 2D6
LigandBDBM50198075
Substrate/Competitorn/a
Meas. Tech.ChEMBL_515428 (CHEMBL1028887)
Ki 450±n/a nM
Citation Ponte-Sucre, AGulder, TWegehaupt, AAlbert, CRikanovic, CSchaeflein, LFrank, ASchultheis, MUnger, MHolzgrabe, UBringmann, GMoll, H Structure-activity relationship and studies on the molecular mechanism of leishmanicidal N,C-coupled arylisoquinolinium salts. J Med Chem52:626-36 (2009) 
 
Cytochrome P450 2D6
Name:Cytochrome P450 2D6
Type:Protein
Mol. Mass.:55774.82
Organism:Homo sapiens (Human)
Description:P10635
Residue:497
BDBM50198075
NameBDBM50198075
Synonyms:6,8-dimethoxy-1,3-dimethyl-2-(naphthalen-1-yl)isoquinolinium perchlorate N,1'-naphthyl-6,8-dimethoxy-1,3-dimethylisoquinolinium perchlorate
TypeSmall organic molecule
Emp. Form.C23H22NO2
Mol. Mass.344.4257
SMILESCOc1cc(OC)c2c(C)[n+](c(C)cc2c1)-c1cccc2ccccc12