Reaction Details
TargetCycloartenol synthase
LigandBDBM50255432
Substrate/Competitorn/a
Meas. Tech.ChEMBL_515551 (CHEMBL1036572)
IC50 70±n/a nM
Citation Balliano, GDehmlow, HOliaro-Bosso, SScaldaferri, MTaramino, SViola, FCaron, GAebi, JAckermann, J Oxidosqualene cyclase from Saccharomyces cerevisiae, Trypanosoma cruzi, Pneumocystis carinii and Arabidopsis thaliana expressed in yeast: a model for the development of novel antiparasitic agents. Bioorg Med Chem Lett19:718-23 (2009) 
 
Cycloartenol synthase
Name:Cycloartenol synthase
Type:PROTEIN
Mol. Mass.:86025.20
Organism:Arabidopsis thaliana
Description:ChEMBL_956102
Residue:759
BDBM50255432
NameBDBM50255432
Synonyms:CHEMBL516921 | N-allyl-4-(3-(4-bromophenyl)benzo[d]isothiazol-6-yloxy)-N-methylbutan-1-amine
TypeSmall organic molecule
Emp. Form.C21H23BrN2OS
Mol. Mass.431.389
SMILESCN(CCCCOc1ccc2c(nsc2c1)-c1ccc(Br)cc1)CC=C