Reaction Details
TargetCycloartenol synthase
LigandBDBM50128070
Substrate/Competitorn/a
Meas. Tech.ChEMBL_515551 (CHEMBL1036572)
IC50 250±n/a nM
Citation Balliano, GDehmlow, HOliaro-Bosso, SScaldaferri, MTaramino, SViola, FCaron, GAebi, JAckermann, J Oxidosqualene cyclase from Saccharomyces cerevisiae, Trypanosoma cruzi, Pneumocystis carinii and Arabidopsis thaliana expressed in yeast: a model for the development of novel antiparasitic agents. Bioorg Med Chem Lett19:718-23 (2009) 
 
Cycloartenol synthase
Name:Cycloartenol synthase
Type:PROTEIN
Mol. Mass.:86025.20
Organism:Arabidopsis thaliana
Description:ChEMBL_956102
Residue:759
BDBM50128070
NameBDBM50128070
Synonyms:(4''-{[ALLYL(METHYL)AMINO]METHYL}-1,1''-BIPHENYL-4-YL)(4-BROMOPHENYL)METHANONE CHEMBL65230 | {4'-[(Allyl-methyl-amino)-methyl]-biphenyl-4-yl}-(4-bromo-phenyl)-methanone
TypeSmall organic molecule
Emp. Form.C24H22BrNO
Mol. Mass.420.342
SMILESCN(CC=C)Cc1ccc(cc1)-c1ccc(cc1)C(=O)c1ccc(Br)cc1