Reaction Details
TargetCycloartenol synthase
LigandBDBM50255532
Substrate/Competitorn/a
Meas. Tech.ChEMBL_515551 (CHEMBL1036572)
IC50 440±n/a nM
Citation Balliano, GDehmlow, HOliaro-Bosso, SScaldaferri, MTaramino, SViola, FCaron, GAebi, JAckermann, J Oxidosqualene cyclase from Saccharomyces cerevisiae, Trypanosoma cruzi, Pneumocystis carinii and Arabidopsis thaliana expressed in yeast: a model for the development of novel antiparasitic agents. Bioorg Med Chem Lett19:718-23 (2009) 
 
Cycloartenol synthase
Name:Cycloartenol synthase
Type:PROTEIN
Mol. Mass.:86025.20
Organism:Arabidopsis thaliana
Description:ChEMBL_956102
Residue:759
BDBM50255532
NameBDBM50255532
Synonyms:CHEMBL481199 | N-(4-(5-(allyl(methyl)amino)pentyl)cyclohexyl)-N-methyl-4-(trifluoromethyl)benzenesulfonamide
TypeSmall organic molecule
Emp. Form.C23H35F3N2O2S
Mol. Mass.460.596
SMILESCN(CCCCC[C@H]1CC[C@@H](CC1)N(C)S(=O)(=O)c1ccc(cc1)C(F)(F)F)CC=C