Reaction Details
TargetCycloartenol synthase
LigandBDBM50255531
Substrate/Competitorn/a
Meas. Tech.ChEMBL_515551 (CHEMBL1036572)
IC50 700±n/a nM
Citation Balliano, GDehmlow, HOliaro-Bosso, SScaldaferri, MTaramino, SViola, FCaron, GAebi, JAckermann, J Oxidosqualene cyclase from Saccharomyces cerevisiae, Trypanosoma cruzi, Pneumocystis carinii and Arabidopsis thaliana expressed in yeast: a model for the development of novel antiparasitic agents. Bioorg Med Chem Lett19:718-23 (2009) 
 
Cycloartenol synthase
Name:Cycloartenol synthase
Type:PROTEIN
Mol. Mass.:86025.20
Organism:Arabidopsis thaliana
Description:ChEMBL_956102
Residue:759
BDBM50255531
NameBDBM50255531
Synonyms:4-chlorophenyl 4-(5-(ethyl(2-hydroxyethyl)amino)pentyl)cyclohexyl(methyl)carbamate hydrochloride | CHEMBL480259
TypeSmall organic molecule
Emp. Form.C23H37ClN2O3
Mol. Mass.425.004
SMILESCCN(CCO)CCCCC[C@H]1CC[C@@H](CC1)N(C)C(=O)Oc1ccc(Cl)cc1