Reaction Details
TargetCycloartenol synthase
LigandBDBM50255530
Substrate/Competitorn/a
Meas. Tech.ChEMBL_515551 (CHEMBL1036572)
IC50 800±n/a nM
Citation Balliano, GDehmlow, HOliaro-Bosso, SScaldaferri, MTaramino, SViola, FCaron, GAebi, JAckermann, J Oxidosqualene cyclase from Saccharomyces cerevisiae, Trypanosoma cruzi, Pneumocystis carinii and Arabidopsis thaliana expressed in yeast: a model for the development of novel antiparasitic agents. Bioorg Med Chem Lett19:718-23 (2009) 
 
Cycloartenol synthase
Name:Cycloartenol synthase
Type:PROTEIN
Mol. Mass.:86025.20
Organism:Arabidopsis thaliana
Description:ChEMBL_956102
Residue:759
BDBM50255530
NameBDBM50255530
Synonyms:CHEMBL516767 | N-(4-(3-(4-bromophenyl)benzo[d]isothiazol-6-yloxy)butyl)-N-(2-hydroxyethyl)acetamide
TypeSmall organic molecule
Emp. Form.C21H23BrN2O3S
Mol. Mass.463.388
SMILESCC(=O)N(CCO)CCCCOc1ccc2c(nsc2c1)-c1ccc(Br)cc1