Reaction Details
TargetCycloartenol synthase
LigandBDBM50128063
Substrate/Competitorn/a
Meas. Tech.ChEMBL_515551 (CHEMBL1036572)
IC50 950±n/a nM
Citation Balliano, GDehmlow, HOliaro-Bosso, SScaldaferri, MTaramino, SViola, FCaron, GAebi, JAckermann, J Oxidosqualene cyclase from Saccharomyces cerevisiae, Trypanosoma cruzi, Pneumocystis carinii and Arabidopsis thaliana expressed in yeast: a model for the development of novel antiparasitic agents. Bioorg Med Chem Lett19:718-23 (2009) 
 
Cycloartenol synthase
Name:Cycloartenol synthase
Type:PROTEIN
Mol. Mass.:86025.20
Organism:Arabidopsis thaliana
Description:ChEMBL_956102
Residue:759
BDBM50128063
NameBDBM50128063
Synonyms:Allyl-{6-[3-(4-bromo-phenyl)-benzo[d]isothiazol-6-yloxy]-hexyl}-methyl-amine CHEMBL67133 N-allyl-6-(3-(4-bromophenyl)benzo[d]isothiazol-6-yloxy)-N-methylhexan-1-aminium
TypeSmall organic molecule
Emp. Form.C23H27BrN2OS
Mol. Mass.459.442
SMILESCN(CCCCCCOc1ccc2c(nsc2c1)-c1ccc(Br)cc1)CC=C