Reaction Details
TargetCycloartenol synthase
LigandBDBM50255600
Substrate/Competitorn/a
Meas. Tech.ChEMBL_515551 (CHEMBL1036572)
IC50 2000±n/a nM
Citation Balliano, GDehmlow, HOliaro-Bosso, SScaldaferri, MTaramino, SViola, FCaron, GAebi, JAckermann, J Oxidosqualene cyclase from Saccharomyces cerevisiae, Trypanosoma cruzi, Pneumocystis carinii and Arabidopsis thaliana expressed in yeast: a model for the development of novel antiparasitic agents. Bioorg Med Chem Lett19:718-23 (2009) 
 
Cycloartenol synthase
Name:Cycloartenol synthase
Type:PROTEIN
Mol. Mass.:86025.20
Organism:Arabidopsis thaliana
Description:ChEMBL_956102
Residue:759
BDBM50255600
NameBDBM50255600
Synonyms:CHEMBL481208 | N,N-diethyl-5-(4-(N-methyl-4-(trifluoromethyl)phenylsulfonamido)cyclohexyl)pentanamide
TypeSmall organic molecule
Emp. Form.C23H35F3N2O3S
Mol. Mass.476.596
SMILESCCN(CC)C(=O)CCCC[C@H]1CC[C@@H](CC1)N(C)S(=O)(=O)c1ccc(cc1)C(F)(F)F