Reaction Details
TargetPotassium voltage-gated channel subfamily H member 2
LigandBDBM50255768
Substrate/Competitorn/a
Meas. Tech.ChEMBL_515691 (CHEMBL993079)
Ki>100±n/a nM
Citation Montgomery, JIToogood, PLHutchings, KMLiu, JNarasimhan, LBraden, TDermyer, MRKulynych, ADSmith, YDWarmus, JSTaylor, C Discovery and SAR of benzyl phenyl ethers as inhibitors of bacterial phenylalanyl-tRNA synthetase. Bioorg Med Chem Lett19:665-9 (2009) 
 
Potassium voltage-gated channel subfamily H member 2
Name:Potassium voltage-gated channel subfamily H member 2
Type:Multi-pass membrane protein
Mol. Mass.:126672.65
Organism:Homo sapiens (Human)
Description:Q12809
Residue:1159
BDBM50255768
NameBDBM50255768
Synonyms:2-(4-chloro-5-(3-chlorobenzyloxy)pyridin-2-yl)-1,3,4-oxadiazole | CHEMBL506548
TypeSmall organic molecule
Emp. Form.C14H9Cl2N3O2
Mol. Mass.322.146
SMILESClc1cccc(COc2cnc(cc2Cl)-c2nnco2)c1