Reaction Details
TargetVascular endothelial growth factor receptor 2
LigandBDBM50277281
Substrate/Competitorn/a
Meas. Tech.ChEMBL_540596 (CHEMBL1023845)
Ki 130±n/a nM
Citation Kiselyov, ASSemenova, MSemenov, VV 3,4-Disubstituted isothiazoles: novel potent inhibitors of VEGF receptors 1 and 2. Bioorg Med Chem Lett19:1195-8 (2009) 
 
Vascular endothelial growth factor receptor 2
Name:Vascular endothelial growth factor receptor 2
Type:Receptor Tyrosine Kinase
Mol. Mass.:151510.97
Organism:Homo sapiens (Human)
Description:P35968
Residue:1356
BDBM50277281
NameBDBM50277281
Synonyms:4-(pyridin-4-ylmethylamino)-N-(3-(trifluoromethyl)phenyl)isothiazole-3-carboxamide | CHEMBL515880
TypeSmall organic molecule
Emp. Form.C17H13F3N4OS
Mol. Mass.378.372
SMILESFC(F)(F)c1cccc(NC(=O)c2nscc2NCc2ccncc2)c1