Reaction Details
TargetRibokinase
LigandBDBM50255788
Substrate/Competitorn/a
Meas. Tech.ChEMBL_515843 (CHEMBL1030542)
IC50>33000±n/a nM
Citation Desroy, NMoreau, FBriet, SLe Fralliec, GFloquet, SDurant, LVongsouthi, VGerusz, VDenis, AEscaich, S Towards Gram-negative antivirulence drugs: new inhibitors of HldE kinase. Bioorg Med Chem17:1276-89 (2009) 
 
Ribokinase
Name:Ribokinase
Type:PROTEIN
Mol. Mass.:32281.04
Organism:Escherichia coli (strain K12)
Description:ChEMBL_515843
Residue:309
BDBM50255788
NameBDBM50255788
Synonyms:((1,3-Benzothiazol-2-ylmethyl){[4-methyl-2-(2-naphthyl)-1,3-thiazol-5-yl]carbonyl}amino)acetic acid | CHEMBL479438
TypeSmall organic molecule
Emp. Form.C25H19N3O3S2
Mol. Mass.473.567
SMILESCc1nc(sc1C(=O)N(CC(O)=O)Cc1nc2ccccc2s1)-c1ccc2ccccc2c1