Reaction Details
TargetCathepsin S
LigandBDBM50255733
Substrate/Competitorn/a
Meas. Tech.ChEMBL_515844 (CHEMBL1030543)
Ki 13±n/a nM
Citation Ayesa, SLindquist, CAgback, TBenkestock, KClasson, BHenderson, IHewitt, EJansson, KKallin, ASheppard, DSamuelsson, B Solid-phase parallel synthesis and SAR of 4-amidofuran-3-one inhibitors of cathepsin S: effect of sulfonamides P3 substituents on potency and selectivity. Bioorg Med Chem17:1307-24 (2009) 
 
Cathepsin S
Name:Cathepsin S
Type:Protein
Mol. Mass.:37507.38
Organism:Homo sapiens (Human)
Description:P25774
Residue:331
BDBM50255733
NameBDBM50255733
Synonyms:CHEMBL481433 | N-[1-(2S-Ethyl-4-oxo-tetrahydro-furan-3S-ylcarbamoyl)-2S-(1-methyl-cyclopentyl)-ethyl]-4-(4-methyl-thiazole-2-sulfonylamino)-benzamide
TypeSmall organic molecule
Emp. Form.C26H34N4O6S2
Mol. Mass.562.701
SMILESCC[C@@H]1OCC(=O)[C@H]1NC(=O)[C@H](CC1(C)CCCC1)NC(=O)c1ccc(NS(=O)(=O)c2nc(C)cs2)cc1