Reaction Details
TargetCathepsin S
LigandBDBM50255410
Substrate/Competitorn/a
Meas. Tech.ChEMBL_515844 (CHEMBL1030543)
Ki 63±n/a nM
Citation Ayesa, SLindquist, CAgback, TBenkestock, KClasson, BHenderson, IHewitt, EJansson, KKallin, ASheppard, DSamuelsson, B Solid-phase parallel synthesis and SAR of 4-amidofuran-3-one inhibitors of cathepsin S: effect of sulfonamides P3 substituents on potency and selectivity. Bioorg Med Chem17:1307-24 (2009) 
 
Cathepsin S
Name:Cathepsin S
Type:Protein
Mol. Mass.:37507.38
Organism:Homo sapiens (Human)
Description:P25774
Residue:331
BDBM50255410
NameBDBM50255410
Synonyms:CHEMBL519763 | N-[1-(2S-Ethyl-4-oxo-tetrahydro-furan-3S-ylcarbamoyl)-2S-(1-methyl-cyclopentyl)-ethyl]-6-methanesulfonylaminonicotinamide
TypeSmall organic molecule
Emp. Form.C22H32N4O6S
Mol. Mass.480.578
SMILESCC[C@@H]1OCC(=O)[C@H]1NC(=O)[C@H](CC1(C)CCCC1)NC(=O)c1ccc(NS(C)(=O)=O)nc1