Reaction Details
TargetCathepsin S
LigandBDBM50255130
Substrate/Competitorn/a
Meas. Tech.ChEMBL_515844 (CHEMBL1030543)
Ki 2.4±n/a nM
Citation Ayesa, SLindquist, CAgback, TBenkestock, KClasson, BHenderson, IHewitt, EJansson, KKallin, ASheppard, DSamuelsson, B Solid-phase parallel synthesis and SAR of 4-amidofuran-3-one inhibitors of cathepsin S: effect of sulfonamides P3 substituents on potency and selectivity. Bioorg Med Chem17:1307-24 (2009) 
 
Cathepsin S
Name:Cathepsin S
Type:Protein
Mol. Mass.:37507.38
Organism:Homo sapiens (Human)
Description:P25774
Residue:331
BDBM50255130
NameBDBM50255130
Synonyms:4-Cyclopropanesulfonylamino-N-[1-(2S-ethyl-4-oxo-tetrahydro-furan-3S-ylcarbamoyl)-2S-(1-methyl-cyclopentyl)-ethyl]-benzamide | CHEMBL479831
TypeSmall organic molecule
Emp. Form.C25H35N3O6S
Mol. Mass.505.627
SMILESCC[C@@H]1OCC(=O)[C@H]1NC(=O)[C@H](CC1(C)CCCC1)NC(=O)c1ccc(NS(=O)(=O)C2CC2)cc1