Reaction Details
TargetPoly [ADP-ribose] polymerase 1
LigandBDBM50255358
Substrate/Competitorn/a
Meas. Tech.ChEMBL_515852 (CHEMBL993111)
IC50 240±n/a nM
Citation Zhang, WTRuan, JLWu, PFJiang, FCZhang, LNFang, WChen, XLWang, YCao, BSChen, GYZhu, YJGu, JChen, JG Design, synthesis, and cytoprotective effect of 2-aminothiazole analogues as potent poly(ADP-ribose) polymerase-1 inhibitors. J Med Chem52:718-25 (2009) 
 
Poly [ADP-ribose] polymerase 1
Name:Poly [ADP-ribose] polymerase 1
Type:n/a
Mol. Mass.:113114.22
Organism:Homo sapiens (Human)
Description:P09874
Residue:1014
BDBM50255358
NameBDBM50255358
Synonyms:(E)-N-((1H-Indol-3-yl)methylene)-4-(2,4-diethoxyphenyl)thiazol-2-amine | CHEMBL480452
TypeSmall organic molecule
Emp. Form.C22H21N3O2S
Mol. Mass.391.486
SMILESCCOc1ccc(-c2csc(\N=C\c3c[nH]c4ccccc34)n2)c(OCC)c1