Reaction Details
TargetPoly [ADP-ribose] polymerase 1
LigandBDBM50165496
Substrate/Competitorn/a
Meas. Tech.ChEMBL_515852 (CHEMBL993111)
IC50 3.8±n/a nM
Citation Zhang, WTRuan, JLWu, PFJiang, FCZhang, LNFang, WChen, XLWang, YCao, BSChen, GYZhu, YJGu, JChen, JG Design, synthesis, and cytoprotective effect of 2-aminothiazole analogues as potent poly(ADP-ribose) polymerase-1 inhibitors. J Med Chem52:718-25 (2009) 
 
Poly [ADP-ribose] polymerase 1
Name:Poly [ADP-ribose] polymerase 1
Type:n/a
Mol. Mass.:113114.22
Organism:Homo sapiens (Human)
Description:P09874
Residue:1014
BDBM50165496
NameBDBM50165496
Synonyms:1-(2-fluoro-5-((4-oxo-3,4-dihydrophthalazin-1-yl)methyl)phenyl)-3-methylpyrrolidine-2,5-dione CHEMBL370838
TypeSmall organic molecule
Emp. Form.C20H16FN3O3
Mol. Mass.365.3577
SMILESCc1cc(O)n(c1O)-c1cc(Cc2n[nH]c(=O)c3ccccc23)ccc1F