Reaction Details
TargetPoly [ADP-ribose] polymerase 1
LigandBDBM50165486
Substrate/Competitorn/a
Meas. Tech.ChEMBL_515852 (CHEMBL993111)
IC50 5±n/a nM
Citation Zhang, WTRuan, JLWu, PFJiang, FCZhang, LNFang, WChen, XLWang, YCao, BSChen, GYZhu, YJGu, JChen, JG Design, synthesis, and cytoprotective effect of 2-aminothiazole analogues as potent poly(ADP-ribose) polymerase-1 inhibitors. J Med Chem52:718-25 (2009) 
 
Poly [ADP-ribose] polymerase 1
Name:Poly [ADP-ribose] polymerase 1
Type:n/a
Mol. Mass.:113114.22
Organism:Homo sapiens (Human)
Description:P09874
Residue:1014
BDBM50165486
NameBDBM50165486
Synonyms:1-(2-fluoro-5-((4-oxo-3,4-dihydrophthalazin-1-yl)methyl)phenyl)pyrrolidine-2,5-dione CHEMBL196444 | KU-58684
TypeSmall organic molecule
Emp. Form.C19H14FN3O3
Mol. Mass.351.3312
SMILESOc1ccc(O)n1-c1cc(Cc2n[nH]c(=O)c3ccccc23)ccc1F