Reaction Details
TargetPoly [ADP-ribose] polymerase 1
LigandBDBM50120243
Substrate/Competitorn/a
Meas. Tech.ChEMBL_515852 (CHEMBL993111)
IC50 200±n/a nM
Citation Zhang, WTRuan, JLWu, PFJiang, FCZhang, LNFang, WChen, XLWang, YCao, BSChen, GYZhu, YJGu, JChen, JG Design, synthesis, and cytoprotective effect of 2-aminothiazole analogues as potent poly(ADP-ribose) polymerase-1 inhibitors. J Med Chem52:718-25 (2009) 
 
Poly [ADP-ribose] polymerase 1
Name:Poly [ADP-ribose] polymerase 1
Type:n/a
Mol. Mass.:113114.22
Organism:Homo sapiens (Human)
Description:P09874
Residue:1014
BDBM50120243
NameBDBM50120243
Synonyms:3-(2,4-Dioxo-3,4,5,6,7,8-hexahydro-2H-quinazolin-1-yl)-N-[2-oxo-2-(4-phenyl-piperazin-1-yl)-ethyl]-propionamide CHEMBL322268
TypeSmall organic molecule
Emp. Form.C23H29N5O4
Mol. Mass.439.5075
SMILESO=C(CCn1c2CCCCc2c(=O)[nH]c1=O)NCC(=O)N1CCN(CC1)c1ccccc1