Reaction Details
TargetEstrogen receptor beta
LigandBDBM50255198
Substrate/Competitorn/a
Meas. Tech.ChEMBL_515889 (CHEMBL993943)
Ki 7.1±n/a nM
Citation Minutolo, FBertini, SGranchi, CMarchitiello, TProta, GRapposelli, STuccinardi, TMartinelli, AGunther, JRCarlson, KEKatzenellenbogen, JAMacchia, M Structural evolutions of salicylaldoximes as selective agonists for estrogen receptor beta. J Med Chem52:858-67 (2009) 
 
Estrogen receptor beta
Name:Estrogen receptor beta
Type:Protein
Mol. Mass.:59238.43
Organism:Homo sapiens (Human)
Description:Q92731
Residue:530
BDBM50255198
NameBDBM50255198
Synonyms:(E)-3-Chloro-4-(3-fluoro-4-hydroxyphenyl)salicylaldoxime | CHEMBL509051
TypeSmall organic molecule
Emp. Form.C13H9ClFNO3
Mol. Mass.281.667
SMILESOc1ccc(cc1F)-c1ccc(CN=O)c(O)c1Cl